Target
Voltage-dependent N-type calcium channel subunit alpha-1B
Ligand
BDBM50333703
Substrate
Meas. Tech.
ChEMBL_700439 (CHEMBL1647978)
IC50
190±n/a nM
Citation
 Tyagarajan, SChakravarty, PKPark, MZhou, BHerrington, JBRatliff, KBugianesi, RMWilliams, BHaedo, RJSwensen, AMWarren, VASmith, MGarcia, MKaczorowski, GJMcManus, OBLyons, KALi, XMadeira, MKaranam, BGreen, MForrest, MJAbbadie, CMcGowan, EMistry, SJochnowitz, NDuffy, JL A potent and selective indole N-type calcium channel (Ca(v)2.2) blocker for the treatment of pain. Bioorg Med Chem Lett 21:869-73 (2011)  
Target
Name:
Voltage-dependent N-type calcium channel subunit alpha-1B
Synonyms:
BIII CAC1B_HUMAN CACNA1B Calcium channel (Type N) Voltage-dependent N-type calcium channel subunit alpha-1B Voltage-gated N-type calcium channel alpha-1B subunit Voltage-gated calcium channel Voltage-gated calcium channel subunit alpha Cav2.2 ((alpha 1B, beta 1b, alpha 2 delta-1) | calcium channel, voltage-dependent, N type, alpha 1B subunit
Type:
Enzyme
Mol. Mass.:
262548.16
Organism:
Homo sapiens (Human)
Description:
Q00975
Residue:
2339
  
Inhibitor
Name:
BDBM50333703
Synonyms:
CHEMBL1643724 | N-tert-butyl-2-(1-(2-(tert-butylamino)-2-oxoethyl)-2-(3,5-dimethylphenyl)-1H-indol-5-yl)-2-methylpropanamide
Type:
Small organic molecule
Emp. Form.:
C30H41N3O2
Mol. Mass.:
475.6654
SMILES:
Cc1cc(C)cc(c1)-c1cc2cc(ccc2n1CC(=O)NC(C)(C)C)C(C)(C)C(=O)NC(C)(C)C
: