Target
Voltage-dependent N-type calcium channel subunit alpha-1B
Ligand
BDBM50333717
Substrate
Meas. Tech.
ChEMBL_700439 (CHEMBL1647978)
IC50
870±n/a nM
Citation
 Tyagarajan, SChakravarty, PKPark, MZhou, BHerrington, JBRatliff, KBugianesi, RMWilliams, BHaedo, RJSwensen, AMWarren, VASmith, MGarcia, MKaczorowski, GJMcManus, OBLyons, KALi, XMadeira, MKaranam, BGreen, MForrest, MJAbbadie, CMcGowan, EMistry, SJochnowitz, NDuffy, JL A potent and selective indole N-type calcium channel (Ca(v)2.2) blocker for the treatment of pain. Bioorg Med Chem Lett 21:869-73 (2011)  
Target
Name:
Voltage-dependent N-type calcium channel subunit alpha-1B
Synonyms:
BIII CAC1B_HUMAN CACNA1B Calcium channel (Type N) Voltage-dependent N-type calcium channel subunit alpha-1B Voltage-gated N-type calcium channel alpha-1B subunit Voltage-gated calcium channel Voltage-gated calcium channel subunit alpha Cav2.2 ((alpha 1B, beta 1b, alpha 2 delta-1) | calcium channel, voltage-dependent, N type, alpha 1B subunit
Type:
Enzyme
Mol. Mass.:
262548.16
Organism:
Homo sapiens (Human)
Description:
Q00975
Residue:
2339
  
Inhibitor
Name:
BDBM50333717
Synonyms:
2-(2-(3,5-dimethylphenyl)-1-(2-hydroxypropyl)-1H-indol-5-yl)-N,N,2-trimethylpropanamide | CHEMBL1643714
Type:
Small organic molecule
Emp. Form.:
C25H32N2O2
Mol. Mass.:
392.5338
SMILES:
CC(O)Cn1c(cc2cc(ccc12)C(C)(C)C(=O)N(C)C)-c1cc(C)cc(C)c1
: