Target
Voltage-dependent N-type calcium channel subunit alpha-1B
Ligand
BDBM50333718
Substrate
Meas. Tech.
ChEMBL_700439 (CHEMBL1647978)
IC50
880±n/a nM
Citation
 Tyagarajan, SChakravarty, PKPark, MZhou, BHerrington, JBRatliff, KBugianesi, RMWilliams, BHaedo, RJSwensen, AMWarren, VASmith, MGarcia, MKaczorowski, GJMcManus, OBLyons, KALi, XMadeira, MKaranam, BGreen, MForrest, MJAbbadie, CMcGowan, EMistry, SJochnowitz, NDuffy, JL A potent and selective indole N-type calcium channel (Ca(v)2.2) blocker for the treatment of pain. Bioorg Med Chem Lett 21:869-73 (2011)  
Target
Name:
Voltage-dependent N-type calcium channel subunit alpha-1B
Synonyms:
BIII CAC1B_HUMAN CACNA1B Calcium channel (Type N) Voltage-dependent N-type calcium channel subunit alpha-1B Voltage-gated N-type calcium channel alpha-1B subunit Voltage-gated calcium channel Voltage-gated calcium channel subunit alpha Cav2.2 ((alpha 1B, beta 1b, alpha 2 delta-1) | calcium channel, voltage-dependent, N type, alpha 1B subunit
Type:
Enzyme
Mol. Mass.:
262548.16
Organism:
Homo sapiens (Human)
Description:
Q00975
Residue:
2339
  
Inhibitor
Name:
BDBM50333718
Synonyms:
(S)-1-(7-azabicyclo[2.2.1]heptan-7-yl)-2-(2-(3,5-dimethylphenyl)-3-(1-(propylamino)ethyl)-1H-indol-5-yl)-2-methylpropan-1-one | CHEMBL1643712
Type:
Small organic molecule
Emp. Form.:
C31H41N3O
Mol. Mass.:
471.6767
SMILES:
CCCN[C@@H](C)c1c([nH]c2ccc(cc12)C(C)(C)C(=O)N1C2CCC1CC2)-c1cc(C)cc(C)c1
: