Target
Nuclear receptor subfamily 1 group I member 2
Ligand
BDBM50333724
Substrate
Meas. Tech.
ChEMBL_700443 (CHEMBL1647982)
EC50
10760±n/a nM
Citation
 Tyagarajan, SChakravarty, PKPark, MZhou, BHerrington, JBRatliff, KBugianesi, RMWilliams, BHaedo, RJSwensen, AMWarren, VASmith, MGarcia, MKaczorowski, GJMcManus, OBLyons, KALi, XMadeira, MKaranam, BGreen, MForrest, MJAbbadie, CMcGowan, EMistry, SJochnowitz, NDuffy, JL A potent and selective indole N-type calcium channel (Ca(v)2.2) blocker for the treatment of pain. Bioorg Med Chem Lett 21:869-73 (2011)  
Target
Name:
Nuclear receptor subfamily 1 group I member 2
Synonyms:
NR1I2 Orphan nuclear receptor PAR1 PXR SXR nuclear receptor subfamily 1 group I member 2 isoform 1
Type:
Nuclear receptor
Mol. Mass.:
49774.77
Organism:
Homo sapiens (Human)
Description:
O75469
Residue:
434
  
Inhibitor
Name:
BDBM50333724
Synonyms:
2-(2-(3,5-bis(trifluoromethyl)phenyl)-1-(2-(tert-butylamino)-2-oxoethyl)-1H-indol-5-yl)-N-tert-butyl-2-methylpropanamide | CHEMBL1643730
Type:
Small organic molecule
Emp. Form.:
C30H35F6N3O2
Mol. Mass.:
583.6082
SMILES:
CC(C)(C)NC(=O)Cn1c(cc2cc(ccc12)C(C)(C)C(=O)NC(C)(C)C)-c1cc(cc(c1)C(F)(F)F)C(F)(F)F
: