Target
Carboxylic ester hydrolase
Ligand
BDBM50333770
Substrate
Meas. Tech.
ChEMBL_700711 (CHEMBL1645750)
IC50
9.73±n/a nM
Citation
 Luo, WLi, YPHe, YHuang, SLTan, JHOu, TMLi, DGu, LQHuang, ZS Design, synthesis and evaluation of novel tacrine-multialkoxybenzene hybrids as dual inhibitors for cholinesterases and amyloid beta aggregation. Bioorg Med Chem 19:763-70 (2011)  
Target
Name:
Carboxylic ester hydrolase
Synonyms:
BuChE Butyrylcholine esterase Butyrylcholinesterase (BChE) Butyrylcholinesterase (EqBuChE) butyrylcholinesterase precursor
Type:
Protein
Mol. Mass.:
68842.83
Organism:
Equus caballus (Horse)
Description:
Q9N1N9
Residue:
602
  
Inhibitor
Name:
BDBM50333770
Synonyms:
CHEMBL1644285 | N1-((7-Methoxybenzo[d][1,3]dioxol-5-yl)methyl)-N7-(1,2,3,4-tetrahydroacridin-9-yl)heptane-1,7-diamine
Type:
Small organic molecule
Emp. Form.:
C29H37N3O3
Mol. Mass.:
475.6224
SMILES:
COc1cc(CNCCCCCCCNc2c3CCCCc3nc3ccccc23)cc2OCOc12
: