Target
Metabotropic glutamate receptor 5
Ligand
BDBM50334105
Substrate
Meas. Tech.
ChEMBL_698078 (CHEMBL1645998)
Ki
3±n/a nM
Citation
 Gilbert, AMBursavich, MGLombardi, SAdedoyin, ADwyer, JMHughes, ZKern, JCKhawaja, XRosenzweig-Lipson, SMoore, WJNeal, SJOlsen, MRizzo, SJSpringer, D 3-(Pyridin-2-yl-ethynyl)benzamide metabotropic glutamate receptor 5 negative allosteric modulators: hit to lead studies. Bioorg Med Chem Lett 21:195-9 (2010)  
Target
Name:
Metabotropic glutamate receptor 5
Synonyms:
GRM5_RAT Grm5 Mglur5 metabotropic glutamate 5/1-C metabotropic glutamate 5a
Type:
Enzyme
Mol. Mass.:
131900.14
Organism:
Rattus norvegicus (Rat)
Description:
P31424
Residue:
1203
  
Inhibitor
Name:
BDBM50334105
Synonyms:
(4-methoxy-3-(phenylethynyl)phenyl)(4-(5-methylpyridin-2-yl)piperazin-1-yl)methanone | CHEMBL1645015
Type:
Small organic molecule
Emp. Form.:
C26H25N3O2
Mol. Mass.:
411.4956
SMILES:
COc1ccc(cc1C#Cc1ccccc1)C(=O)N1CCN(CC1)c1ccc(C)cn1
: