Target
Tyrosine-protein kinase ZAP-70
Ligand
BDBM50413752
Substrate
Meas. Tech.
ChEMBL_701630 (CHEMBL1656389)
IC50
>10000±n/a nM
Citation
 Liniger, MNeuhaus, CHofmann, TFransioli-Ignazio, LJordi, MDrueckes, PTrappe, JsFabbro, D Kinase Inhibition by Deoxy Analogues of the Resorcylic Lactone L-783277 ACS Med Chem Lett 2:22-27 (2011)  
Target
Name:
Tyrosine-protein kinase ZAP-70
Synonyms:
70 kDa zeta-associated protein Syk-related tyrosine kinase Tyrosine-protein kinase ZAP-70 Tyrosine-protein kinase ZAP-70 (ZAP70) ZAP70 Zeta-chain (TCR) associated protein kinase 70kDa
Type:
Enzyme
Mol. Mass.:
69881.61
Organism:
Homo sapiens (Human)
Description:
ZAP-70 SH2 domain was expressed and purified from E. coli using O-phospho-L-tyrosine-agarose column.
Residue:
619
  
Inhibitor
Name:
BDBM50413752
Synonyms:
CHEMBL2012519 | L-783277
Type:
Small organic molecule
Emp. Form.:
C19H24O7
Mol. Mass.:
364.3897
SMILES:
COc1cc(O)c2c(CCCC(=O)C(=O)C(O)CCC[C@H](C)OC2=O)c1
: