Target
Aurora kinase A
Ligand
BDBM50318573
Substrate
Meas. Tech.
ChEMBL_715420 (CHEMBL1664805)
IC50
81±n/a nM
Citation
 Lan, PChen, WNChen, WM Molecular modeling studies on imidazo[4,5-b]pyridine derivatives as Aurora A kinase inhibitors using 3D-QSAR and docking approaches. Eur J Med Chem 46:77-94 (2010)  
Target
Name:
Aurora kinase A
Synonyms:
AIK ARK-1 AURA AURKA_HUMAN Aurora 2 Aurora kinase A (AURKA) Aurora kinase A (Aurora-2) Aurora/IPL1-related kinase 1 Breast tumor-amplified kinase IAK1 STK15 GN Serine/threonine kinase 15 Serine/threonine-protein kinase 6 Serine/threonine-protein kinase aurora-A aurora-2 | hARK1
Type:
Serine/threonine-protein kinase
Mol. Mass.:
45830.98
Organism:
Homo sapiens (Human)
Description:
O14965
Residue:
403
  
Inhibitor
Name:
BDBM50318573
Synonyms:
2-[4-(6-Bromo-2-phenyl-3H-imidazo[4,5-b]pyridin-7-yl)-piperazin-1-yl]-Nthiazol-2-yl-acetamide | CHEMBL1082830
Type:
Small organic molecule
Emp. Form.:
C21H20BrN7OS
Mol. Mass.:
498.399
SMILES:
Brc1cnc2nc([nH]c2c1N1CCN(CC(=O)Nc2nccs2)CC1)-c1ccccc1
: