Target
Adenosine receptor A2b
Ligand
BDBM50157672
Substrate
Meas. Tech.
ChEMBL_715068 (CHEMBL1664118)
Ki
76.6±n/a nM
Citation
 Yaziji, VRodríguez, DGutiérrez-de-Terán, HCoelho, ACaamaño, OGarcía-Mera, XBrea, JLoza, MICadavid, MISotelo, E Pyrimidine derivatives as potent and selective A3 adenosine receptor antagonists. J Med Chem 54:457-71 (2011)  
Target
Name:
Adenosine receptor A2b
Synonyms:
AA2BR_HUMAN ADORA2B Adenosine receptors A2b | Adenosine receptors; A2a & A2b
Type:
G Protein-Coupled Receptor (GPCR)
Mol. Mass.:
36341.22
Organism:
Homo sapiens (Human)
Description:
Residue:
332
  
Inhibitor
Name:
BDBM50157672
Synonyms:
CHEMBL222474 | N-(2,6-diphenylpyrimidin-4-yl)propionamide
Type:
Small organic molecule
Emp. Form.:
C19H17N3O
Mol. Mass.:
303.3578
SMILES:
CCC(=O)Nc1cc(nc(n1)-c1ccccc1)-c1ccccc1
: