Target
72 kDa type IV collagenase
Ligand
BDBM32203
Substrate
Meas. Tech.
ChEMBL_715236 (CHEMBL1664437)
IC50
130000±n/a nM
Citation
 Jacobsen, JAFullagar, JLMiller, MTCohen, SM Identifying chelators for metalloprotein inhibitors using a fragment-based approach. J Med Chem 54:591-602 (2011)  
Target
Name:
72 kDa type IV collagenase
Synonyms:
72 kDa gelatinase CLG4A Gelatinase A (MMP-2) MMP2_HUMAN Matrix metalloproteinase-2 (MMP 2) Matrix metalloproteinases 2 (MMP-2) | TBE-1
Type:
Enzyme
Mol. Mass.:
73870.36
Organism:
Homo sapiens (Human)
Description:
P08253
Residue:
660
  
Inhibitor
Name:
BDBM32203
Synonyms:
8-quinolinol US10005735, Table 1.7 cid_1923 quinolin-8-ol
Type:
Small organic molecule
Emp. Form.:
C9H7NO
Mol. Mass.:
145.158
SMILES:
Oc1cccc2cccnc12
: