Target
Prostaglandin E2 receptor EP4 subtype
Ligand
BDBM50335990
Substrate
Meas. Tech.
ChEMBL_717061 (CHEMBL1671179)
IC50
3±n/a nM
Citation
 Burch, JDFarand, JColucci, JSturino, CDucharme, YFriesen, RWLévesque, JFGagné, SWrona, MTherien, AGMathieu, MCDenis, DVigneault, EXu, DClark, PRowland, SHan, Y Naphthalene/quinoline amides and sulfonylureas as potent and selective antagonists of the EP4 receptor. Bioorg Med Chem Lett 21:1041-6 (2011)  
Target
Name:
Prostaglandin E2 receptor EP4 subtype
Synonyms:
PE2R4_HUMAN PGE2 receptor EP4 subtype PTGER4 Prostanoid EP4 receptor
Type:
Enzyme
Mol. Mass.:
53134.53
Organism:
Homo sapiens (Human)
Description:
P35408
Residue:
488
  
Inhibitor
Name:
BDBM50335990
Synonyms:
2,6-dichloro-N-(1-(4-(4,9-diethoxy-1-oxo-1H-benzo[f]isoindol-2(3H)-yl)-3-methylbenzyl)cyclopropylcarbamoyl)benzenesulfonamide | CHEMBL1669008
Type:
Small organic molecule
Emp. Form.:
C34H33Cl2N3O6S
Mol. Mass.:
682.613
SMILES:
CCOc1c2CN(C(=O)c2c(OCC)c2ccccc12)c1ccc(CC2(CC2)NC(=O)NS(=O)(=O)c2c(Cl)cccc2Cl)cc1C
: