Target
Cathepsin K
Ligand
BDBM19491
Substrate
Meas. Tech.
ChEMBL_718115 (CHEMBL1671568)
IC50
0.3±n/a nM
Citation
 Isabel, EMellon, CBoyd, MJChauret, NDeschênes, DDesmarais, SFalgueyret, JPGauthier, JYKhougaz, KLau, CKLéger, SLevorse, DALi, CSMassé, FPercival, MDRoy, BScheigetz, JThérien, MTruong, VLWesolowski, GYoung, RNZamboni, RBlack, WC Difluoroethylamines as an amide isostere in inhibitors of cathepsin K. Bioorg Med Chem Lett 21:920-3 (2011)  
Target
Name:
Cathepsin K
Synonyms:
CATK_HUMAN CTSO Cathepsin O Cathepsin X
Type:
Enzyme
Mol. Mass.:
36975.68
Organism:
Homo sapiens (Human)
Description:
P43235
Residue:
329
  
Inhibitor
Name:
BDBM19491
Synonyms:
(2S)-N-(1-cyanocyclopropyl)-4-methyl-2-{[(1S)-2,2,2-trifluoro-1-[4-(4-methanesulfonylphenyl)phenyl]ethyl]amino}pentanamide | trifluoroethylamine inhibitor, 1
Type:
Small organic molecule
Emp. Form.:
C25H28F3N3O3S
Mol. Mass.:
507.568
SMILES:
CC(C)C[C@H](N[C@@H](c1ccc(cc1)-c1ccc(cc1)S(C)(=O)=O)C(F)(F)F)C(=O)NC1(CC1)C#N
: