Target
Cathepsin K
Ligand
BDBM19489
Substrate
Meas. Tech.
ChEMBL_718115 (CHEMBL1671568)
IC50
0.2±n/a nM
Citation
 Isabel, EMellon, CBoyd, MJChauret, NDeschênes, DDesmarais, SFalgueyret, JPGauthier, JYKhougaz, KLau, CKLéger, SLevorse, DALi, CSMassé, FPercival, MDRoy, BScheigetz, JThérien, MTruong, VLWesolowski, GYoung, RNZamboni, RBlack, WC Difluoroethylamines as an amide isostere in inhibitors of cathepsin K. Bioorg Med Chem Lett 21:920-3 (2011)  
Target
Name:
Cathepsin K
Synonyms:
CATK_HUMAN CTSO Cathepsin O Cathepsin X
Type:
Enzyme
Mol. Mass.:
36975.68
Organism:
Homo sapiens (Human)
Description:
P43235
Residue:
329
  
Inhibitor
Name:
BDBM19489
Synonyms:
(2S)-N-(cyanomethyl)-4-methyl-2-[[(1S)-2,2,2-trifluoro-1-[4-(4-methylsulfon CHEMBL437501 | L-873724
Type:
Small organic molecule
Emp. Form.:
C23H26F3N3O3S
Mol. Mass.:
481.531
SMILES:
CC(C)C[C@H](N[C@@H](c1ccc(cc1)-c1ccc(cc1)S(C)(=O)=O)C(F)(F)F)C(=O)NCC#N
: