Target
Cathepsin K
Ligand
BDBM50336095
Substrate
Meas. Tech.
ChEMBL_718115 (CHEMBL1671568)
IC50
0.3±n/a nM
Citation
 Isabel, EMellon, CBoyd, MJChauret, NDeschênes, DDesmarais, SFalgueyret, JPGauthier, JYKhougaz, KLau, CKLéger, SLevorse, DALi, CSMassé, FPercival, MDRoy, BScheigetz, JThérien, MTruong, VLWesolowski, GYoung, RNZamboni, RBlack, WC Difluoroethylamines as an amide isostere in inhibitors of cathepsin K. Bioorg Med Chem Lett 21:920-3 (2011)  
Target
Name:
Cathepsin K
Synonyms:
CATK_HUMAN CTSO Cathepsin O Cathepsin X
Type:
Enzyme
Mol. Mass.:
36975.68
Organism:
Homo sapiens (Human)
Description:
P43235
Residue:
329
  
Inhibitor
Name:
BDBM50336095
Synonyms:
1-(4'-((S)-1-((S)-1-(1-cyanocyclopropylamino)-4-fluoro-4-methyl-1-oxopentan-2-ylamino)-2,2,2-trifluoroethyl)-2-fluorobiphenyl-4-yl)cyclopropanecarboxamide | CHEMBL1669442
Type:
Small organic molecule
Emp. Form.:
C28H29F5N4O2
Mol. Mass.:
548.5475
SMILES:
CC(C)(F)C[C@H](N[C@@H](c1ccc(cc1)-c1ccc(cc1F)C1(CC1)C(N)=O)C(F)(F)F)C(=O)NC1(CC1)C#N
: