Target
Polyphenol oxidase 2
Ligand
BDBM50336362
Substrate
Meas. Tech.
ChEMBL_716753 (CHEMBL1670635)
IC50
5840±n/a nM
Citation
 Fang, YChen, YFeng, GMa, L Benzyl benzoates: New phlorizin analogs as mushroom tyrosinase inhibitors. Bioorg Med Chem 19:1167-71 (2011)  
Target
Name:
Polyphenol oxidase 2
Synonyms:
Monophenol monooxygenase PPO2 Tyrosinase
Type:
Protein
Mol. Mass.:
63923.66
Organism:
Agaricus bisporus (Common mushroom)
Description:
O42713
Residue:
556
  
Inhibitor
Name:
BDBM50336362
Synonyms:
4-Hydroxybenzyl 3,5-dihydroxybenzoate | CHEMBL1668049
Type:
Small organic molecule
Emp. Form.:
C14H12O5
Mol. Mass.:
260.2421
SMILES:
Oc1ccc(COC(=O)c2cc(O)cc(O)c2)cc1
: