Target
Cytosol aminopeptidase
Ligand
BDBM50336493
Substrate
Meas. Tech.
ChEMBL_716909 (CHEMBL1670937)
IC50
>1000000±n/a nM
Citation
 Albrecht, SAl-Lakkis-Wehbe, MOrsini, ADefoin, APale, PSalomon, ETarnus, CWeibel, JM Amino-benzosuberone: a novel warhead for selective inhibition of human aminopeptidase-N/CD13. Bioorg Med Chem 19:1434-49 (2011)  
Target
Name:
Cytosol aminopeptidase
Synonyms:
AMPL_BOVIN LAP3 Leucine Aminopeptidase | Leucyl aminopeptidase
Type:
Homohexamer
Mol. Mass.:
56288.28
Organism:
Bos taurus (bovine)
Description:
Bovine kidney LAPc was purchased from Sigma Chemical Co.
Residue:
519
  
Inhibitor
Name:
BDBM50336493
Synonyms:
1-Aminoindan-2-one, hydrochloride | CHEMBL1668624
Type:
Small organic molecule
Emp. Form.:
C9H9NO
Mol. Mass.:
147.1739
SMILES:
NC1C(=O)Cc2ccccc12
: