Target
Leukotriene A-4 hydrolase
Ligand
BDBM50336493
Substrate
Meas. Tech.
ChEMBL_716910 (CHEMBL1670938)
IC50
>1000000±n/a nM
Citation
 Albrecht, SAl-Lakkis-Wehbe, MOrsini, ADefoin, APale, PSalomon, ETarnus, CWeibel, JM Amino-benzosuberone: a novel warhead for selective inhibition of human aminopeptidase-N/CD13. Bioorg Med Chem 19:1434-49 (2011)  
Target
Name:
Leukotriene A-4 hydrolase
Synonyms:
LKHA4_HUMAN LTA4 Leukotriene A(4) hydrolase Leukotriene A4 hydrolase
Type:
Hydrolase; metalloprotease
Mol. Mass.:
69280.41
Organism:
Homo sapiens (Human)
Description:
Human recombinant LTA4H.
Residue:
611
  
Inhibitor
Name:
BDBM50336493
Synonyms:
1-Aminoindan-2-one, hydrochloride | CHEMBL1668624
Type:
Small organic molecule
Emp. Form.:
C9H9NO
Mol. Mass.:
147.1739
SMILES:
NC1C(=O)Cc2ccccc12
: