Target
Adenosylhomocysteinase
Ligand
BDBM50336548
Substrate
Meas. Tech.
ChEMBL_725342 (CHEMBL1676754)
IC50
60170±n/a nM
Citation
 Lee, KMChoi, WJLee, YLee, HJZhao, LXLee, HWPark, JGKim, HOHwang, KYHeo, YSChoi, SJeong, LS X-ray crystal structure and binding mode analysis of human S-adenosylhomocysteine hydrolase complexed with novel mechanism-based inhibitors, haloneplanocin A analogues. J Med Chem 54:930-8 (2011)  
Target
Name:
Adenosylhomocysteinase
Synonyms:
AHCY SAHH | SAHH_HUMAN
Type:
PROTEIN
Mol. Mass.:
47714.06
Organism:
Homo sapiens (Human)
Description:
ChEMBL_1507791
Residue:
432
  
Inhibitor
Name:
BDBM50336548
Synonyms:
5-(6-Aminopurin-9-yl)-4-bromo-3-hydroxymethyl-cyclopent-3-ene-1,2-diol | CHEMBL1672009
Type:
Small organic molecule
Emp. Form.:
C11H12BrN5O3
Mol. Mass.:
342.149
SMILES:
Nc1ncnc2n(cnc12)[C@H]1[C@H](O)[C@H](O)C(CO)=C1Br
: