Target
Gamma-aminobutyric acid receptor subunit rho-1
Ligand
BDBM50211642
Substrate
Meas. Tech.
ChEMBL_718201 (CHEMBL1679247)
IC50
2220±n/a nM
Citation
 Gavande, NYamamoto, ISalam, NKAi, THBurden, PMJohnston, GAHanrahan, JR Novel Cyclic Phosphinic Acids as GABAC ρ Receptor Antagonists: Design, Synthesis, and Pharmacology ACS Med Chem Lett 2:11-16 (2011)  
Target
Name:
Gamma-aminobutyric acid receptor subunit rho-1
Synonyms:
GABA receptor rho-1 subunit GABRR1 | GBRR1_HUMAN
Type:
PROTEIN
Mol. Mass.:
55892.34
Organism:
Homo sapiens (Human)
Description:
ChEMBL_1456653
Residue:
479
  
Inhibitor
Name:
BDBM50211642
Synonyms:
CHEMBL397209 methyl(1,2,3,6-tetrahydropyridin-4-yl)phosphinic acid
Type:
Small organic molecule
Emp. Form.:
C6H12NO2P
Mol. Mass.:
161.1387
SMILES:
CP(O)(=O)C1=CCNCC1
: