Target
Androgen receptor
Ligand
BDBM50228076
Substrate
Meas. Tech.
ChEMBL_718594 (CHEMBL1680620)
Ki
676±n/a nM
Citation
 Richardson, TIClarke, CAYu, KLYee, YKBleisch, TJLopez, JEJones, SAHughes, NEMuehl, BSLugar, CWMoore, TLShetler, PKZink, RWOsborne, JJMontrose-Rafizadeh, CPatel, NGeiser, AGGalvin, RJ Novel 3-Aryl Indoles as Progesterone Receptor Antagonists for Uterine Fibroids ACS Med Chem Lett 2:148-153 (2011)  
Target
Name:
Androgen receptor
Synonyms:
ANDR_HUMAN Androgen Receptor Androgen receptor/Baculoviral IAP repeat-containing protein 2 Dihydrotestosterone receptor Nuclear receptor subfamily 3 group C member 4
Type:
Receptor
Mol. Mass.:
99185.27
Organism:
Homo sapiens (Human)
Description:
CHO cells were stably transfected with human AR gene.
Residue:
920
  
Inhibitor
Name:
BDBM50228076
Synonyms:
(R)-N-(3-(1-cyclopropyl-1-(2,4-difluorophenyl)ethyl)-1H-indol-7-yl)methanesulfonamide | CHEMBL391231
Type:
Small organic molecule
Emp. Form.:
C20H20F2N2O2S
Mol. Mass.:
390.447
SMILES:
C[C@@](C1CC1)(c1c[nH]c2c(NS(C)(=O)=O)cccc12)c1ccc(F)cc1F
: