Target
Sodium/glucose cotransporter 2
Ligand
BDBM50337051
Substrate
Meas. Tech.
ChEMBL_718745 (CHEMBL1680964)
IC50
4.69±n/a nM
Citation
 Song, KSLee, SHKim, MJSeo, HJLee, JLee, SHJung, MESon, EJLee, MKim, J Synthesis and SAR of Thiazolylmethylphenyl Glucoside as Novel C-Aryl Glucoside SGLT2 Inhibitors ACS Med Chem Lett 2:182-187 (2011)  
Target
Name:
Sodium/glucose cotransporter 2
Synonyms:
Na(+)/glucose cotransporter 2 SGLT2 Sodium-Dependent Glucose Cotransporter 2 (SGLT2) Solute carrier family 5 member 2
Type:
Protein
Mol. Mass.:
72902.00
Organism:
Homo sapiens (Human)
Description:
P31639
Residue:
672
  
Inhibitor
Name:
BDBM50337051
Synonyms:
(2S,3R,4R,5S,6R,E)-2-(3-((5-(but-2-en-2-yl)thiazol-2-yl)methyl)-4-chlorophenyl)-6-(hydroxymethyl)-tetrahydro-2H-pyran-3,4,5-triol | CHEMBL1672779
Type:
Small organic molecule
Emp. Form.:
C20H24ClNO5S
Mol. Mass.:
425.926
SMILES:
C\C=C(/C)c1cnc(Cc2cc(ccc2Cl)[C@@H]2O[C@H](CO)[C@@H](O)[C@H](O)[C@H]2O)s1
: