Target
Sodium/glucose cotransporter 2
Ligand
BDBM50337057
Substrate
Meas. Tech.
ChEMBL_718745 (CHEMBL1680964)
IC50
19.6±n/a nM
Citation
 Song, KSLee, SHKim, MJSeo, HJLee, JLee, SHJung, MESon, EJLee, MKim, J Synthesis and SAR of Thiazolylmethylphenyl Glucoside as Novel C-Aryl Glucoside SGLT2 Inhibitors ACS Med Chem Lett 2:182-187 (2011)  
Target
Name:
Sodium/glucose cotransporter 2
Synonyms:
Na(+)/glucose cotransporter 2 SGLT2 Sodium-Dependent Glucose Cotransporter 2 (SGLT2) Solute carrier family 5 member 2
Type:
Protein
Mol. Mass.:
72902.00
Organism:
Homo sapiens (Human)
Description:
P31639
Residue:
672
  
Inhibitor
Name:
BDBM50337057
Synonyms:
(2S,3R,4R,5S,6R)-2-(3-((5-butoxythiazol-2-yl)methyl)-4-chlorophenyl)-6-(hydroxymethyl)tetrahydro-2H-pyran-3,4,5-triol | CHEMBL1672785
Type:
Small organic molecule
Emp. Form.:
C20H26ClNO6S
Mol. Mass.:
443.942
SMILES:
CCCCOc1cnc(Cc2cc(ccc2Cl)[C@@H]2O[C@H](CO)[C@@H](O)[C@H](O)[C@H]2O)s1
: