Target
Sodium/glucose cotransporter 2
Ligand
BDBM50337069
Substrate
Meas. Tech.
ChEMBL_718745 (CHEMBL1680964)
IC50
13.3±n/a nM
Citation
 Song, KSLee, SHKim, MJSeo, HJLee, JLee, SHJung, MESon, EJLee, MKim, J Synthesis and SAR of Thiazolylmethylphenyl Glucoside as Novel C-Aryl Glucoside SGLT2 Inhibitors ACS Med Chem Lett 2:182-187 (2011)  
Target
Name:
Sodium/glucose cotransporter 2
Synonyms:
Na(+)/glucose cotransporter 2 SGLT2 Sodium-Dependent Glucose Cotransporter 2 (SGLT2) Solute carrier family 5 member 2
Type:
Protein
Mol. Mass.:
72902.00
Organism:
Homo sapiens (Human)
Description:
P31639
Residue:
672
  
Inhibitor
Name:
BDBM50337069
Synonyms:
(2S,3R,4R,5S,6R)-2-(4-Chloro-3-((5-(5-chlorothiophen-2-yl)thiazol-2-yl)methyl)phenyl)-6-(hydroxymethyl)tetrahydro-2H-pyran-3,4,5-triol | CHEMBL1672797
Type:
Small organic molecule
Emp. Form.:
C20H19Cl2NO5S2
Mol. Mass.:
488.405
SMILES:
OC[C@H]1O[C@H]([C@H](O)[C@@H](O)[C@@H]1O)c1ccc(Cl)c(Cc2ncc(s2)-c2ccc(Cl)s2)c1
: