Target
Sodium/glucose cotransporter 2
Ligand
BDBM50337074
Substrate
Meas. Tech.
ChEMBL_718745 (CHEMBL1680964)
IC50
1.43±n/a nM
Citation
 Song, KSLee, SHKim, MJSeo, HJLee, JLee, SHJung, MESon, EJLee, MKim, J Synthesis and SAR of Thiazolylmethylphenyl Glucoside as Novel C-Aryl Glucoside SGLT2 Inhibitors ACS Med Chem Lett 2:182-187 (2011)  
Target
Name:
Sodium/glucose cotransporter 2
Synonyms:
Na(+)/glucose cotransporter 2 SGLT2 Sodium-Dependent Glucose Cotransporter 2 (SGLT2) Solute carrier family 5 member 2
Type:
Protein
Mol. Mass.:
72902.00
Organism:
Homo sapiens (Human)
Description:
P31639
Residue:
672
  
Inhibitor
Name:
BDBM50337074
Synonyms:
(2S,3R,4R,5S,6R)-2-(3-((5-(Furan-2-yl)thiazol-2-yl)methyl)-4-methylphenyl)-6-(hydroxymethyl)tetrahydro-2H-pyran-3,4,5-triol | CHEMBL1672802
Type:
Small organic molecule
Emp. Form.:
C21H23NO6S
Mol. Mass.:
417.475
SMILES:
Cc1ccc(cc1Cc1ncc(s1)-c1ccco1)[C@@H]1O[C@H](CO)[C@@H](O)[C@H](O)[C@H]1O
: