Target
Sodium/glucose cotransporter 2
Ligand
BDBM50337081
Substrate
Meas. Tech.
ChEMBL_718745 (CHEMBL1680964)
IC50
14.6±n/a nM
Citation
 Song, KSLee, SHKim, MJSeo, HJLee, JLee, SHJung, MESon, EJLee, MKim, J Synthesis and SAR of Thiazolylmethylphenyl Glucoside as Novel C-Aryl Glucoside SGLT2 Inhibitors ACS Med Chem Lett 2:182-187 (2011)  
Target
Name:
Sodium/glucose cotransporter 2
Synonyms:
Na(+)/glucose cotransporter 2 SGLT2 Sodium-Dependent Glucose Cotransporter 2 (SGLT2) Solute carrier family 5 member 2
Type:
Protein
Mol. Mass.:
72902.00
Organism:
Homo sapiens (Human)
Description:
P31639
Residue:
672
  
Inhibitor
Name:
BDBM50337081
Synonyms:
(2R,3S,4R,5R,6S)-2-(Hydroxymethyl)-6-(3-((5-(thiophen-3-yl)thiazol-2-yl)methyl)-4-(trifluoromethyl)phenyl)tetrahydro-2H-pyran-3,4,5-triol | CHEMBL1672809
Type:
Small organic molecule
Emp. Form.:
C22H21F3O5S2
Mol. Mass.:
486.524
SMILES:
OC[C@H]1O[C@H]([C@H](O)[C@@H](O)[C@@H]1O)c1ccc(c(Cc2ccc(s2)-c2ccsc2)c1)C(F)(F)F
: