Target
Sodium/glucose cotransporter 2
Ligand
BDBM50337084
Substrate
Meas. Tech.
ChEMBL_718745 (CHEMBL1680964)
IC50
140±n/a nM
Citation
 Song, KSLee, SHKim, MJSeo, HJLee, JLee, SHJung, MESon, EJLee, MKim, J Synthesis and SAR of Thiazolylmethylphenyl Glucoside as Novel C-Aryl Glucoside SGLT2 Inhibitors ACS Med Chem Lett 2:182-187 (2011)  
Target
Name:
Sodium/glucose cotransporter 2
Synonyms:
Na(+)/glucose cotransporter 2 SGLT2 Sodium-Dependent Glucose Cotransporter 2 (SGLT2) Solute carrier family 5 member 2
Type:
Protein
Mol. Mass.:
72902.00
Organism:
Homo sapiens (Human)
Description:
P31639
Residue:
672
  
Inhibitor
Name:
BDBM50337084
Synonyms:
2-((5-(Thiophen-3-yl)thiazol-2-yl)methyl)-4-((2S,3R,4R,5S,6R)-3,4,5-trihydroxy-6-(hydroxymethyl)-tetrahydro-2H-pyran-2-yl)benzonitrile | CHEMBL1672812
Type:
Small organic molecule
Emp. Form.:
C21H20N2O5S2
Mol. Mass.:
444.524
SMILES:
OC[C@H]1O[C@H]([C@H](O)[C@@H](O)[C@@H]1O)c1ccc(C#N)c(Cc2ncc(s2)-c2ccsc2)c1
: