Target
C-X-C chemokine receptor type 3
Ligand
BDBM50337250
Substrate
Meas. Tech.
ChEMBL_726362 (CHEMBL1687494)
IC50
0.3±n/a nM
Citation
 Shao, YAnilkumar, GNCarroll, CDDong, GHall, JWHobbs, DWJiang, YJenh, CHKim, SHKozlowski, JAMcGuinness, BFRosenblum, SBSchulman, IShih, NYShu, YWong, MKYu, WZawacki, LGZeng, Q II. SAR studies of pyridyl-piperazinyl-piperidine derivatives as CXCR3 chemokine antagonists. Bioorg Med Chem Lett 21:1527-31 (2011)  
Target
Name:
C-X-C chemokine receptor type 3
Synonyms:
AAO92295.1 C-X-C chemokine receptor type 3 (CXCR3) CXCR3 CXCR3_HUMAN chemokine (C-X-C motif) receptor 3
Type:
Enzyme Catalytic Domain
Mol. Mass.:
40665.65
Organism:
Homo sapiens (Human)
Description:
Residue:
368
  
Inhibitor
Name:
BDBM50337250
Synonyms:
(S)-5-chloro-6-(4-(1-(4-chlorobenzyl)piperidin-4-yl)-3-ethylpiperazin-1-yl)-N-ethylnicotinamide | CHEMBL472288
Type:
Small organic molecule
Emp. Form.:
C26H35Cl2N5O
Mol. Mass.:
504.495
SMILES:
CCNC(=O)c1cnc(N2CCN([C@@H](CC)C2)C2CCN(Cc3ccc(Cl)cc3)CC2)c(Cl)c1
: