Target
C-X-C chemokine receptor type 3
Ligand
BDBM50337250
Substrate
Meas. Tech.
ChEMBL_726359 (CHEMBL1687491)
IC50
0.5±n/a nM
Citation
 Shao, YAnilkumar, GNCarroll, CDDong, GHall, JWHobbs, DWJiang, YJenh, CHKim, SHKozlowski, JAMcGuinness, BFRosenblum, SBSchulman, IShih, NYShu, YWong, MKYu, WZawacki, LGZeng, Q II. SAR studies of pyridyl-piperazinyl-piperidine derivatives as CXCR3 chemokine antagonists. Bioorg Med Chem Lett 21:1527-31 (2011)  
Target
Name:
C-X-C chemokine receptor type 3
Synonyms:
CXCR3_MOUSE Cxcr3
Type:
PROTEIN
Mol. Mass.:
41020.84
Organism:
Mus musculus
Description:
ChEMBL_560734
Residue:
367
  
Inhibitor
Name:
BDBM50337250
Synonyms:
(S)-5-chloro-6-(4-(1-(4-chlorobenzyl)piperidin-4-yl)-3-ethylpiperazin-1-yl)-N-ethylnicotinamide | CHEMBL472288
Type:
Small organic molecule
Emp. Form.:
C26H35Cl2N5O
Mol. Mass.:
504.495
SMILES:
CCNC(=O)c1cnc(N2CCN([C@@H](CC)C2)C2CCN(Cc3ccc(Cl)cc3)CC2)c(Cl)c1
: