Target
Serine/threonine-protein kinase pim-1
Ligand
BDBM50337326
Substrate
Meas. Tech.
ChEMBL_726512 (CHEMBL1685407)
Ki
>8570±n/a nM
Citation
 Akritopoulou-Zanze, IWakefield, BDGasiecki, AKalvin, DJohnson, EFKovar, PDjuric, SW Scaffold oriented synthesis. Part 3: design, synthesis and biological evaluation of novel 5-substituted indazoles as potent and selective kinase inhibitors employing [2+3] cycloadditions. Bioorg Med Chem Lett 21:1476-9 (2011)  
Target
Name:
Serine/threonine-protein kinase pim-1
Synonyms:
PIM-1 Kinase PIM1_HUMAN Serine/threonine-protein kinase (PIM1) Serine/threonine-protein kinase PIM1 | Serine/threonine-protein kinase pim-1 (PIM1)
Type:
Protein
Mol. Mass.:
35681.82
Organism:
Homo sapiens (Human)
Description:
P11309
Residue:
313
  
Inhibitor
Name:
BDBM50337326
Synonyms:
5-(1H-indazol-5-yl)-3-propylisoxazole | CHEMBL1682359
Type:
Small organic molecule
Emp. Form.:
C13H13N3O
Mol. Mass.:
227.2618
SMILES:
CCCc1cc(on1)-c1ccc2[nH]ncc2c1
: