Target
Tyrosine-protein kinase JAK2
Ligand
BDBM50337326
Substrate
Meas. Tech.
ChEMBL_726509 (CHEMBL1685404)
Ki
482±n/a nM
Citation
 Akritopoulou-Zanze, IWakefield, BDGasiecki, AKalvin, DJohnson, EFKovar, PDjuric, SW Scaffold oriented synthesis. Part 3: design, synthesis and biological evaluation of novel 5-substituted indazoles as potent and selective kinase inhibitors employing [2+3] cycloadditions. Bioorg Med Chem Lett 21:1476-9 (2011)  
Target
Name:
Tyrosine-protein kinase JAK2
Synonyms:
JAK-2 JAK2_HUMAN Janus kinase 2 (JAK2) | Janus kinase 2 (a protein tyrosine kinase)
Type:
Protein
Mol. Mass.:
130684.68
Organism:
Homo sapiens (Human)
Description:
O60674
Residue:
1132
  
Inhibitor
Name:
BDBM50337326
Synonyms:
5-(1H-indazol-5-yl)-3-propylisoxazole | CHEMBL1682359
Type:
Small organic molecule
Emp. Form.:
C13H13N3O
Mol. Mass.:
227.2618
SMILES:
CCCc1cc(on1)-c1ccc2[nH]ncc2c1
: