Target
Rho-associated protein kinase 2
Ligand
BDBM50337382
Substrate
Meas. Tech.
ChEMBL_726541 (CHEMBL1685436)
Ki
>6000±n/a nM
Citation
 Akritopoulou-Zanze, IWakefield, BDGasiecki, AKalvin, DJohnson, EFKovar, PDjuric, SW Scaffold oriented synthesis. Part 4: design, synthesis and biological evaluation of novel 5-substituted indazoles as potent and selective kinase inhibitors employing heterocycle forming and multicomponent reactions. Bioorg Med Chem Lett 21:1480-3 (2011)  
Target
Name:
Rho-associated protein kinase 2
Synonyms:
KIAA0619 ROCK2 Rho kinase 2 (ROCKII) Rho-associated protein kinase 2 (ROCK2) Rho-associated protein kinase 2/Transforming protein RhoA Rho-associated, coiled-coil-containing protein kinase II p164 ROCK-2
Type:
Protein
Mol. Mass.:
160885.43
Organism:
Homo sapiens (Human)
Description:
O75116
Residue:
1388
  
Inhibitor
Name:
BDBM50337382
Synonyms:
2-(4-(4-fluorophenyl)-5-(1H-indazol-5-yl)-1H-imidazol-1-yl)-N,N-dimethylethanamine | CHEMBL1682557
Type:
Small organic molecule
Emp. Form.:
C20H20FN5
Mol. Mass.:
349.4047
SMILES:
CN(C)CCn1cnc(c1-c1ccc2[nH]ncc2c1)-c1ccc(F)cc1
: