Target
Aurora kinase B
Ligand
BDBM50337382
Substrate
Meas. Tech.
ChEMBL_726534 (CHEMBL1685429)
Ki
>4900±n/a nM
Citation
 Akritopoulou-Zanze, IWakefield, BDGasiecki, AKalvin, DJohnson, EFKovar, PDjuric, SW Scaffold oriented synthesis. Part 4: design, synthesis and biological evaluation of novel 5-substituted indazoles as potent and selective kinase inhibitors employing heterocycle forming and multicomponent reactions. Bioorg Med Chem Lett 21:1480-3 (2011)  
Target
Name:
Aurora kinase B
Synonyms:
AIK2 AIM1 ARK2 AURKB_HUMAN Aurora B-INCENP Aurora kinase B (AURKB) STK-1 STK12 Serine/threonine-protein kinase aurora B
Type:
Protein
Mol. Mass.:
39327.72
Organism:
Homo sapiens (Human)
Description:
Q96GD4
Residue:
344
  
Inhibitor
Name:
BDBM50337382
Synonyms:
2-(4-(4-fluorophenyl)-5-(1H-indazol-5-yl)-1H-imidazol-1-yl)-N,N-dimethylethanamine | CHEMBL1682557
Type:
Small organic molecule
Emp. Form.:
C20H20FN5
Mol. Mass.:
349.4047
SMILES:
CN(C)CCn1cnc(c1-c1ccc2[nH]ncc2c1)-c1ccc(F)cc1
: