Target
Vascular endothelial growth factor receptor 2
Ligand
BDBM50337382
Substrate
Meas. Tech.
ChEMBL_726538 (CHEMBL1685433)
Ki
>8880±n/a nM
Citation
 Akritopoulou-Zanze, IWakefield, BDGasiecki, AKalvin, DJohnson, EFKovar, PDjuric, SW Scaffold oriented synthesis. Part 4: design, synthesis and biological evaluation of novel 5-substituted indazoles as potent and selective kinase inhibitors employing heterocycle forming and multicomponent reactions. Bioorg Med Chem Lett 21:1480-3 (2011)  
Target
Name:
Vascular endothelial growth factor receptor 2
Synonyms:
CD_antigen=CD309 Fetal liver kinase 1 (FLK-1) KDR Protein-tyrosine kinase receptor Flk-1 VEGFR-2 VEGFR2 Vascular Endothelial Growth Factor Receptor Kinase 2 Vascular endothelial growth factor receptor 2 (KDR) Vascular endothelial growth factor receptor 2 (VEGFR2) Vascular endothelial growth factor receptor-2 (VEGFR-2)
Type:
Receptor Tyrosine Kinase
Mol. Mass.:
151510.97
Organism:
Homo sapiens (Human)
Description:
P35968
Residue:
1356
  
Inhibitor
Name:
BDBM50337382
Synonyms:
2-(4-(4-fluorophenyl)-5-(1H-indazol-5-yl)-1H-imidazol-1-yl)-N,N-dimethylethanamine | CHEMBL1682557
Type:
Small organic molecule
Emp. Form.:
C20H20FN5
Mol. Mass.:
349.4047
SMILES:
CN(C)CCn1cnc(c1-c1ccc2[nH]ncc2c1)-c1ccc(F)cc1
: