Target
Muscarinic acetylcholine receptor M3
Ligand
BDBM50337875
Substrate
Meas. Tech.
ChEMBL_726947 (CHEMBL1686736)
Ki
2.6±n/a nM
Citation
 Hughes, ADChin, KHDunham, SLJasper, JRKing, KELee, TWMammen, MMartin, JSteinfeld, T Discovery of muscarinic acetylcholine receptor antagonist and beta 2 adrenoceptor agonist (MABA) dual pharmacology molecules. Bioorg Med Chem Lett 21:1354-8 (2011)  
Target
Name:
Muscarinic acetylcholine receptor M3
Synonyms:
ACM3_HUMAN Cholinergic, muscarinic M3 Muscarinic receptor M3 | RecName: Full=Muscarinic acetylcholine receptor M3
Type:
Enzyme
Mol. Mass.:
66151.03
Organism:
Homo sapiens (Human)
Description:
P20309
Residue:
590
  
Inhibitor
Name:
BDBM50337875
Synonyms:
1-(12-aminododecyl)piperidin-4-yl biphenyl-2-ylcarbamate | CHEMBL1683930
Type:
Small organic molecule
Emp. Form.:
C30H45N3O2
Mol. Mass.:
479.6972
SMILES:
NCCCCCCCCCCCCN1CCC(CC1)OC(=O)Nc1ccccc1-c1ccccc1
: