Target
Muscarinic acetylcholine receptor M3
Ligand
BDBM50337882
Substrate
Meas. Tech.
ChEMBL_726947 (CHEMBL1686736)
Ki
32±n/a nM
Citation
 Hughes, ADChin, KHDunham, SLJasper, JRKing, KELee, TWMammen, MMartin, JSteinfeld, T Discovery of muscarinic acetylcholine receptor antagonist and beta 2 adrenoceptor agonist (MABA) dual pharmacology molecules. Bioorg Med Chem Lett 21:1354-8 (2011)  
Target
Name:
Muscarinic acetylcholine receptor M3
Synonyms:
ACM3_HUMAN Cholinergic, muscarinic M3 Muscarinic receptor M3 | RecName: Full=Muscarinic acetylcholine receptor M3
Type:
Enzyme
Mol. Mass.:
66151.03
Organism:
Homo sapiens (Human)
Description:
P20309
Residue:
590
  
Inhibitor
Name:
BDBM50337882
Synonyms:
2-((3S)-1-(9-(2-hydroxy-2-(8-hydroxy-2-oxo-1,2-dihydroquinolin-5-yl)ethylamino)nonyl)pyrrolidin-3-yl)-2,2-diphenylacetamide | CHEMBL1683939
Type:
Small organic molecule
Emp. Form.:
C38H48N4O4
Mol. Mass.:
624.8121
SMILES:
NC(=O)C([C@@H]1CCN(CCCCCCCCCNCC(O)c2ccc(O)c3[nH]c(=O)ccc23)C1)(c1ccccc1)c1ccccc1
: