Target
Beta-2 adrenergic receptor
Ligand
BDBM50337876
Substrate
Meas. Tech.
ChEMBL_726948 (CHEMBL1686737)
Ki
19±n/a nM
Citation
 Hughes, ADChin, KHDunham, SLJasper, JRKing, KELee, TWMammen, MMartin, JSteinfeld, T Discovery of muscarinic acetylcholine receptor antagonist and beta 2 adrenoceptor agonist (MABA) dual pharmacology molecules. Bioorg Med Chem Lett 21:1354-8 (2011)  
Target
Name:
Beta-2 adrenergic receptor
Synonyms:
ADRB2 ADRB2_HUMAN Beta-2 adrenoceptor | Beta-2 adrenoreceptor
Type:
Mol. Mass.:
46461.69
Organism:
Homo sapiens (Human)
Description:
P07550
Residue:
413
  
Inhibitor
Name:
BDBM50337876
Synonyms:
(R)-1-(3-(2-hydroxy-2-(8-hydroxy-2-oxo-1,2-dihydroquinolin-5-yl)ethylamino)propyl)piperidin-4-yl biphenyl-2-ylcarbamate | CHEMBL1683931
Type:
Small organic molecule
Emp. Form.:
C32H36N4O5
Mol. Mass.:
556.652
SMILES:
O[C@@H](CNCCCN1CCC(CC1)OC(=O)Nc1ccccc1-c1ccccc1)c1ccc(O)c2[nH]c(=O)ccc12
: