Target
Dual specificity mitogen-activated protein kinase kinase 1
Ligand
BDBM50337927
Substrate
Meas. Tech.
ChEMBL_726976 (CHEMBL1686836)
IC50
16±n/a nM
Citation
 Dong, QDougan, DRGong, XHalkowycz, PJin, BKanouni, TO'Connell, SMScorah, NShi, LWallace, MBZhou, F Discovery of TAK-733, a potent and selective MEK allosteric site inhibitor for the treatment of cancer. Bioorg Med Chem Lett 21:1315-9 (2011)  
Target
Name:
Dual specificity mitogen-activated protein kinase kinase 1
Synonyms:
Dual specificity mitogen-activated protein kinase (MEK) Dual specificity mitogen-activated protein kinase kinase 1 (MEK1) Dual specificity mitogen-activated protein kinase kinase MEK1/2 MAP kinase kinase 1 MAPK/ERK kinase 1 MEK-1 MP2K1_HUMAN PRKMK1 | VHL-MAP2K1/MAP2K2
Type:
Other Protein Type
Mol. Mass.:
43439.03
Organism:
Homo sapiens (Human)
Description:
Full-length human MEK-1 was generated by PCR and purified as a fusion protein from Escherichia coli lysates.
Residue:
393
  
Inhibitor
Name:
BDBM50337927
Synonyms:
(R)-5-(4-bromo-2-fluorophenylamino)-3-(2,3-dihydroxypropyl)-6-fluoro-8-methylpyrido[2,3-d]pyrimidine-4,7(3H,8H)-dione US8470837, 20
Type:
Small organic molecule
Emp. Form.:
C17H15BrF2N4O4
Mol. Mass.:
457.226
SMILES:
Cn1c2ncn(C[C@@H](O)CO)c(=O)c2c(Nc2ccc(Br)cc2F)c(F)c1=O
: