Target
Dual specificity mitogen-activated protein kinase kinase 1
Ligand
BDBM50337935
Substrate
Meas. Tech.
ChEMBL_726976 (CHEMBL1686836)
IC50
26±n/a nM
Citation
 Dong, QDougan, DRGong, XHalkowycz, PJin, BKanouni, TO'Connell, SMScorah, NShi, LWallace, MBZhou, F Discovery of TAK-733, a potent and selective MEK allosteric site inhibitor for the treatment of cancer. Bioorg Med Chem Lett 21:1315-9 (2011)  
Target
Name:
Dual specificity mitogen-activated protein kinase kinase 1
Synonyms:
Dual specificity mitogen-activated protein kinase (MEK) Dual specificity mitogen-activated protein kinase kinase 1 (MEK1) Dual specificity mitogen-activated protein kinase kinase MEK1/2 MAP kinase kinase 1 MAPK/ERK kinase 1 MEK-1 MP2K1_HUMAN PRKMK1 | VHL-MAP2K1/MAP2K2
Type:
Other Protein Type
Mol. Mass.:
43439.03
Organism:
Homo sapiens (Human)
Description:
Full-length human MEK-1 was generated by PCR and purified as a fusion protein from Escherichia coli lysates.
Residue:
393
  
Inhibitor
Name:
BDBM50337935
Synonyms:
5-(2-fluoro-4-iodophenylamino)-3,8-dimethylpyrido[2,3-d]pyrimidine-4,7(3H,8H)-dione US8470837, 1
Type:
Small organic molecule
Emp. Form.:
C15H12FIN4O2
Mol. Mass.:
426.1843
SMILES:
Cn1cnc2n(C)c(=O)cc(Nc3ccc(I)cc3F)c2c1=O
: