Target
Inosine-5'-monophosphate dehydrogenase 2
Ligand
BDBM50338547
Substrate
Meas. Tech.
ChEMBL_728666 (CHEMBL1685943)
Ki
83±n/a nM
Citation
 Felczak, KChen, LWilson, DWilliams, JVince, RPetrelli, RJayaram, HNKusumanchi, PKumar, MPankiewicz, KW Cofactor-type inhibitors of inosine monophosphate dehydrogenase via modular approach: targeting the pyrophosphate binding sub-domain. Bioorg Med Chem 19:1594-605 (2011)  
Target
Name:
Inosine-5'-monophosphate dehydrogenase 2
Synonyms:
IMDH2_HUMAN IMPD 2 IMPDH-II Inosine 5'-monophosphate dehydrogenase II (IMPDH II) Inosine-5 -monophosphate dehydrogenase 2 | Inosine-5'-monophosphate dehydrogenase (IMPDH)
Type:
Enzyme
Mol. Mass.:
55806.87
Organism:
Homo sapiens (Human)
Description:
Recombinant IMPDH2 expressed in E. coli.
Residue:
514
  
Inhibitor
Name:
BDBM50338547
Synonyms:
CHEMBL1683749 | Mycophenolic(adenosine-5'-N-acetamido)phosphonate
Type:
Small organic molecule
Emp. Form.:
C24H29N6O11P
Mol. Mass.:
608.4944
SMILES:
COc1c(C)c2COC(=O)c2c(O)c1CCOP(O)(=O)CC(=O)NC[C@@H]1O[C@@H]([C@@H](O)[C@H]1O)n1cnc2c(N)ncnc12
: