Target
Serine/threonine-protein kinase B-raf
Ligand
BDBM11242
Substrate
Meas. Tech.
ChEMBL_729710 (CHEMBL1697111)
IC50
>100000±n/a nM
Citation
 Ren, XDuan, LHe, QZhang, ZZhou, YWu, DPan, JPei, DDing, KDing, K. Identification of Niclosamide as a New Small-Molecule Inhibitor of the STAT3 Signaling Pathway. ACS Med Chem Lett 1:454-459 (2010)  
Target
Name:
Serine/threonine-protein kinase B-raf
Synonyms:
B-RAF B-Raf proto-oncogene serine/threonine-protein kinase BRAF1 RAFB1 v-Raf murine sarcoma viral oncogene homolog B1
Type:
Serine/threonine-protein kinase
Mol. Mass.:
84446.00
Organism:
Homo sapiens (Human)
Description:
P15056
Residue:
766
  
Inhibitor
Name:
BDBM11242
Synonyms:
5-chloro-N-(2-chloro-4-nitrophenyl)-2-hydroxybenzamide niclosamide
Type:
Small organic molecule
Emp. Form.:
C13H8Cl2N2O4
Mol. Mass.:
327.12
SMILES:
Oc1ccc(Cl)cc1C(=O)Nc1ccc(cc1Cl)[N+]([O-])=O
: