Target
11-beta-hydroxysteroid dehydrogenase type 2
Ligand
BDBM50339808
Substrate
Meas. Tech.
ChEMBL_735656 (CHEMBL1693471)
IC50
33±n/a nM
Citation
 Gaware, RKhunt, RCzollner, LStanetty, CDa Cunha, TKratschmar, DVOdermatt, AKosma, PJordis, UClassen-Houben, D Synthesis of new glycyrrhetinic acid derived ring A azepanone, 29-urea and 29-hydroxamic acid derivatives as selective 11ß-hydroxysteroid dehydrogenase 2 inhibitors. Bioorg Med Chem 19:1866-80 (2011)  
Target
Name:
11-beta-hydroxysteroid dehydrogenase type 2
Synonyms:
11-DH2 11-beta-Hydroxysteroid Dehydrogenase 2 (11-beta-HSD2) 11-beta-hydroxysteroid dehydrogenase 2 11-beta-hydroxysteroid dehydrogenase type 2 (11-beta-HSD2) DHI2_HUMAN HSD11K SDR9C3
Type:
Enzyme
Mol. Mass.:
44141.72
Organism:
Homo sapiens (Human)
Description:
Purified recombinant human 11beta-HSD2.
Residue:
405
  
Inhibitor
Name:
BDBM50339808
Synonyms:
CHEMBL1689279 | N-[(5aR,7aR,7bS,9aS,12S,13aR,15aR,15bS)-2,3,4,5,5a,6,7,7a,7b,8,9,9a,10,11,12,13,13a,15,15a,15b-Eicosahydro-5,5,7a,7b,9a,12,15b-heptamethyl-3,15-dioxo-1H-chryseno[2,1-c]azepine-12-yl]urea
Type:
Small organic molecule
Emp. Form.:
C30H47N3O3
Mol. Mass.:
497.7125
SMILES:
C[C@@]1(CC[C@]2(C)CC[C@]3(C)C(=CC(=O)[C@@H]4[C@@]5(C)CCC(=O)NC(C)(C)[C@@H]5CC[C@@]34C)[C@@H]2C1)NC(N)=O
: