Target
Fatty-acid amide hydrolase 1
Ligand
BDBM50339873
Substrate
Meas. Tech.
ChEMBL_740704 (CHEMBL1763766)
IC50
2±n/a nM
Citation
 Gustin, DJMa, ZMin, XLi, YHedberg, CGuimaraes, CPorter, ACLindstrom, MLester-Zeiner, DXu, GCarlson, TJXiao, SMeleza, CConnors, RWang, ZKayser, F Identification of potent, noncovalent fatty acid amide hydrolase (FAAH) inhibitors. Bioorg Med Chem Lett 21:2492-6 (2011)  
Target
Name:
Fatty-acid amide hydrolase 1
Synonyms:
Anandamide amidohydrolase FAAH FAAH1_HUMAN Fatty-acid amide hydrolase (FAAH) Oleamide hydrolase 1
Type:
Protein
Mol. Mass.:
63071.19
Organism:
Homo sapiens (Human)
Description:
O00519
Residue:
579
  
Inhibitor
Name:
BDBM50339873
Synonyms:
(S)-3-(1-(4-(benzo[b]thiophen-2-yl)pyrimidin-2-yl)piperidin-3-yl)-1-ethyl-1H-imidazo[4,5-b]pyridin-2(3H)-one | CHEMBL1761303
Type:
Small organic molecule
Emp. Form.:
C25H24N6OS
Mol. Mass.:
456.563
SMILES:
CCn1c2cccnc2n([C@H]2CCCN(C2)c2nccc(n2)-c2cc3ccccc3s2)c1=O
: