Target
Acetylcholinesterase
Ligand
BDBM50339951
Substrate
Meas. Tech.
ChEMBL_739672 (CHEMBL1763498)
IC50
35000±n/a nM
Citation
 Komloova, MMusilek, KHorova, AHolas, ODohnal, VGunn-Moore, FKuca, K Preparation, in vitro screening and molecular modelling of symmetrical bis-quinolinium cholinesterase inhibitors--implications for early myasthenia gravis treatment. Bioorg Med Chem Lett 21:2505-9 (2011)  
Target
Name:
Acetylcholinesterase
Synonyms:
ACES_HUMAN Acetylcholinesterase (AChE) | Acetylcholinesterase (human AChE)
Type:
Enzyme
Mol. Mass.:
67792.70
Organism:
Homo sapiens (Human)
Description:
P22303
Residue:
614
  
Inhibitor
Name:
BDBM50339951
Synonyms:
1,1'-(2,2'-oxybis(ethane-2,1-diyl))diquinolinium bromide | CHEMBL1761997
Type:
Small organic molecule
Emp. Form.:
C22H22N2O
Mol. Mass.:
330.4218
SMILES:
C(C[n+]1cccc2ccccc12)OCC[n+]1cccc2ccccc12
: