Target
Cholinesterase
Ligand
BDBM8958
Substrate
Meas. Tech.
ChEMBL_739674 (CHEMBL1763500)
IC50
1600±n/a nM
Citation
 Komloova, MMusilek, KHorova, AHolas, ODohnal, VGunn-Moore, FKuca, K Preparation, in vitro screening and molecular modelling of symmetrical bis-quinolinium cholinesterase inhibitors--implications for early myasthenia gravis treatment. Bioorg Med Chem Lett 21:2505-9 (2011)  
Target
Name:
Cholinesterase
Synonyms:
Acylcholine acylhydrolase Butyrylcholine esterase (BChE) Butyrylcholinesterase (BuChE) CHLE_HUMAN Cholinesterases Pseudocholinesterase
Type:
Homotetramer
Mol. Mass.:
68422.27
Organism:
Homo sapiens (Human)
Description:
P06276
Residue:
602
  
Inhibitor
Name:
BDBM8958
Synonyms:
10-(2-diethylaminopropyl)phenothiazine CHEMBL1206 diethyl[1-(10H-phenothiazin-10-yl)propan-2-yl]amine
Type:
Small organic molecule
Emp. Form.:
C19H24N2S
Mol. Mass.:
312.472
SMILES:
CCN(CC)C(C)CN1c2ccccc2Sc2ccccc12
: