Target
Carbonic anhydrase 1
Ligand
BDBM50269962
Substrate
Meas. Tech.
ChEMBL_739878 (CHEMBL1762938)
Ki
300000±n/a nM
Citation
 Carta, FInnocenti, AHall, RAMühlschlegel, FAScozzafava, ASupuran, CT Carbonic anhydrase inhibitors. Inhibition of the β-class enzymes from the fungal pathogens Candida albicans and Cryptococcus neoformans with branched aliphatic/aromatic carboxylates and their derivatives. Bioorg Med Chem Lett 21:2521-6 (2011)  
Target
Name:
Carbonic anhydrase 1
Synonyms:
CA-I CAB Carbonate dehydratase I Carbonic anhydrase 1 (CA I) Carbonic anhydrase 1 (Recombinant CA I) Carbonic anhydrase B Carbonic anhydrase I (CA I) Carbonic anhydrase I (CAI) Carbonic anhydrase isoenzyme I (hCA I) | hCA
Type:
Enzyme
Mol. Mass.:
28873.37
Organism:
Homo sapiens (Human)
Description:
P00915
Residue:
261
  
Inhibitor
Name:
BDBM50269962
Synonyms:
3-methyl-n-butyrate 3-methylbutyrate beta-methylbutyrate isopentanoate isovalerate | isovalerianate
Type:
Small organic molecule
Emp. Form.:
C5H9O2
Mol. Mass.:
101.1243
SMILES:
CC(C)CC([O-])=O
: