Target
Cannabinoid receptor 1
Ligand
BDBM50340321
Substrate
Meas. Tech.
ChEMBL_741486 (CHEMBL1763801)
IC50
>17000±n/a nM
Citation
 Trotter, BWNanda, KKBurgey, CSPotteiger, CMDeng, JZGreen, AIHartnett, JCKett, NRWu, ZHenze, DADella Penna, KDesai, RLeitl, MDLemaire, WWhite, RBYeh, SUrban, MOKane, SAHartman, GDBilodeau, MT Imidazopyridine CB2 agonists: optimization of CB2/CB1 selectivity and implications for in vivo analgesic efficacy. Bioorg Med Chem Lett 21:2354-8 (2011)  
Target
Name:
Cannabinoid receptor 1
Synonyms:
CANN6 CB-R CNR CNR1_HUMAN Cannabinoid receptor Cannabinoid receptor 1 (brain)
Type:
G Protein-Coupled Receptor (GPCR)
Mol. Mass.:
52868.96
Organism:
Homo sapiens (Human)
Description:
P21554
Residue:
472
  
Inhibitor
Name:
BDBM50340321
Synonyms:
(R)-1-(4,4-difluoropiperidin-1-yl)-N-(3,3-dimethylbutan-2-yl)imidazo[1,5-a]pyrazine-3-carboxamide | CHEMBL1760941
Type:
Small organic molecule
Emp. Form.:
C18H25F2N5O
Mol. Mass.:
365.4208
SMILES:
C[C@@H](NC(=O)c1nc(N2CCC(F)(F)CC2)c2cnccn12)C(C)(C)C
: