Target
Caspase-6
Ligand
BDBM50340537
Substrate
Meas. Tech.
ChEMBL_741340 (CHEMBL1764809)
IC50
450±n/a nM
Citation
 Chu, WRothfuss, JZhou, DMach, RH Synthesis and evaluation of isatin analogs as caspase-3 inhibitors: introduction of a hydrophilic group increases potency in a whole cell assay. Bioorg Med Chem Lett 21:2192-7 (2011)  
Target
Name:
Caspase-6
Synonyms:
Apoptotic protease Mch-2 CASP6 Caspase | MCH2
Type:
Enzyme
Mol. Mass.:
33312.62
Organism:
Homo sapiens (Human)
Description:
P55212
Residue:
293
  
Inhibitor
Name:
BDBM50340537
Synonyms:
(S)-2-(1-(4-methoxybenzyl)-2-oxo-5-(2-((pyridin-3-yloxy)methyl)azetidin-1-ylsulfonyl)indolin-3-ylidene)malononitrile | CHEMBL1762357
Type:
Small organic molecule
Emp. Form.:
C28H23N5O5S
Mol. Mass.:
541.578
SMILES:
[#6]-[#8]-c1ccc(-[#6]-[#7]-2-[#6](=O)\[#6](=[#6](/C#N)C#N)-c3cc(ccc-23)S(=O)(=O)[#7]-2-[#6]-[#6]-[#6@H]-2-[#6]-[#8]-c2cccnc2)cc1
: