Target
Caspase-8
Ligand
BDBM50340542
Substrate
Meas. Tech.
ChEMBL_741342 (CHEMBL1764811)
IC50
>50000±n/a nM
Citation
 Chu, WRothfuss, JZhou, DMach, RH Synthesis and evaluation of isatin analogs as caspase-3 inhibitors: introduction of a hydrophilic group increases potency in a whole cell assay. Bioorg Med Chem Lett 21:2192-7 (2011)  
Target
Name:
Caspase-8
Synonyms:
Apoptotic cysteine protease CAP4 CASP8 Caspase Caspase-8 subunit p18 FADD-like ICE ICE-like apoptotic protease 5 MCH5 | MORT1-associated CED-3 homolog
Type:
Enzyme
Mol. Mass.:
55373.89
Organism:
Homo sapiens (Human)
Description:
Q14790
Residue:
479
  
Inhibitor
Name:
BDBM50340542
Synonyms:
(S)-1-((1-(2-fluoroethyl)-1H-1,2,3-triazol-4-yl)methyl)-5-(2-((pyridin-3-yloxy)methyl)azetidin-1-ylsulfonyl)indoline-2,3-dione | CHEMBL1762362
Type:
Small organic molecule
Emp. Form.:
C22H21FN6O5S
Mol. Mass.:
500.503
SMILES:
FCCn1cc(CN2C(=O)C(=O)c3cc(ccc23)S(=O)(=O)N2CC[C@H]2COc2cccnc2)nn1
: