Target
Substance-K receptor
Ligand
BDBM50341074
Substrate
Meas. Tech.
ChEMBL_740074 (CHEMBL1763134)
Ki
12000±n/a nM
Citation
 Hoveyda, HRRoy, MOBlanc, SNoël, SSalvino, JMAtor, MAFraser, G Discovery of 3-aryl-5-acylpiperazinyl-pyrazoles as antagonists to the NK3 receptor. Bioorg Med Chem Lett 21:1991-6 (2011)  
Target
Name:
Substance-K receptor
Synonyms:
NK-2 receptor NK2R NKNAR Neurokinin A receptor Neurokinin-2 (NK-2) SKR TACR2 Tachykinin receptor 2 (NK2) | hnk-3
Type:
Protein
Mol. Mass.:
44455.78
Organism:
Homo sapiens (Human)
Description:
P21452
Residue:
398
  
Inhibitor
Name:
BDBM50341074
Synonyms:
(4-(2-methoxyphenyl)piperazin-1-yl)(3-phenyl-1H-pyrazol-5-yl)methanone | CHEMBL1760200
Type:
Small organic molecule
Emp. Form.:
C21H22N4O2
Mol. Mass.:
362.425
SMILES:
COc1ccccc1N1CCN(CC1)C(=O)c1cc(n[nH]1)-c1ccccc1
: