Target
Substance-P receptor
Ligand
BDBM50341074
Substrate
Meas. Tech.
ChEMBL_740080 (CHEMBL1763140)
Ki
6700±n/a nM
Citation
 Hoveyda, HRRoy, MOBlanc, SNoël, SSalvino, JMAtor, MAFraser, G Discovery of 3-aryl-5-acylpiperazinyl-pyrazoles as antagonists to the NK3 receptor. Bioorg Med Chem Lett 21:1991-6 (2011)  
Target
Name:
Substance-P receptor
Synonyms:
NK-1 receptor NK1 Receptor NK1R_HUMAN Neurokinin-1 (NK-1) SPR TACR1 Tachykinin receptor 1 (NK1) | tachykinin
Type:
G Protein-Coupled Receptor (GPCR)
Mol. Mass.:
46254.43
Organism:
Homo sapiens (Human)
Description:
P25103
Residue:
407
  
Inhibitor
Name:
BDBM50341074
Synonyms:
(4-(2-methoxyphenyl)piperazin-1-yl)(3-phenyl-1H-pyrazol-5-yl)methanone | CHEMBL1760200
Type:
Small organic molecule
Emp. Form.:
C21H22N4O2
Mol. Mass.:
362.425
SMILES:
COc1ccccc1N1CCN(CC1)C(=O)c1cc(n[nH]1)-c1ccccc1
: